Target
Cyclin-dependent kinase 2
Ligand
BDBM8556
Substrate
Meas. Tech.
OctetRed
pH
7.5±n/a
Temperature
298.15±n/a K
Kd
>100000±n/a nM
Citation
 CSARdock, CD CDK2 in CSAR_FULL_RELEASE_3JULY2012 CSAR 1:0 (2012)  
Target
Name:
Cyclin-dependent kinase 2
Synonyms:
CDK2 CDK2_HUMAN Cell division protein kinase 2 Protein cereblon/Cyclin-dependent kinase 2 | p33 protein kinase
Type:
Enzyme Subunit
Mol. Mass.:
33938.17
Organism:
Homo sapiens (Human)
Description:
P24941
Residue:
298
  
Inhibitor
Name:
BDBM8556
Synonyms:
3-({[5-(pyridin-4-yl)-1,3,4-oxadiazol-2-yl]sulfanyl}methyl)benzoic acid oxadiazole-pyridyl containing compound 16
Type:
Small organic molecule
Emp. Form.:
C15H11N3O3S
Mol. Mass.:
313.331
SMILES:
OC(=O)c1cccc(CSc2nnc(o2)-c2ccncc2)c1
: