Target
Cyclin-dependent kinase 2
Ligand
BDBM91779
Substrate
Meas. Tech.
Thermofluor
pH
7.5±n/a
Temperature
298.15±n/a K
Kd
3595±n/a nM
Citation
 CSARdock, CD CDK2 in CSAR_FULL_RELEASE_3JULY2012 CSAR 1:0 (2012)  
Target
Name:
Cyclin-dependent kinase 2
Synonyms:
CDK2 CDK2_HUMAN Cell division protein kinase 2 Protein cereblon/Cyclin-dependent kinase 2 | p33 protein kinase
Type:
Enzyme Subunit
Mol. Mass.:
33938.17
Organism:
Homo sapiens (Human)
Description:
P24941
Residue:
298
  
Inhibitor
Name:
BDBM91779
Synonyms:
CS244
Type:
Emp. Form.:
C24H20N4O5S2
Mol. Mass.:
508.569
SMILES:
COc1cccc(OC)c1NS(=O)(=O)c1ccc(cc1)N=CC1C(=O)Nc2ccc3ncsc3c12
: