Target
Serine/threonine-protein kinase Chk1
Ligand
BDBM91902
Substrate
Meas. Tech.
Abbott Kinase Enzymatics_CHK1/289 CDC25c
IC50
121±n/a nM
Citation
 CSARdock, CD CHK1 in CSAR_FULL_RELEASE_3JULY2012 CSAR 1:0 (2012)  
Target
Name:
Serine/threonine-protein kinase Chk1
Synonyms:
CHEK1 CHK1 checkpoint homolog Checkpoint kinase-1 (CHK1)
Type:
Enzyme Catalytic Domain
Mol. Mass.:
54443.02
Organism:
Homo sapiens (Human)
Description:
gi_166295192
Residue:
476
  
Inhibitor
Name:
BDBM91902
Synonyms:
Chk1_36
Type:
Emp. Form.:
C28H30N4O5
Mol. Mass.:
502.5616
SMILES:
COc1cc(ccc1O)-c1ccc2c(Nc3ccc(cc3NC2=O)C(=O)NCCCN2CCOCC2)c1
: