Target
Mitogen-activated protein kinase 1
Ligand
BDBM35649
Substrate
Meas. Tech.
Assay 1
Ki
1.0±n/a nM
Citation
 CSARdock, CD ERK2 in CSAR_FULL_RELEASE_3JULY2012 CSAR 1:0 (2012)  
Target
Name:
Mitogen-activated protein kinase 1
Synonyms:
ERK2 Extracellular signal-regulated kinase 2 Extracellular signal-regulated kinase 2 (ERK2) MAPK 2 MK01_HUMAN Mitogen-activated protein kinase 1 (ERK-2) Mitogen-activated protein kinase 2 PRKM2 | p42-MAPK
Type:
Ser/Thr Protein Kinase
Mol. Mass.:
41392.76
Organism:
Homo sapiens (Human)
Description:
P28482
Residue:
360
  
Inhibitor
Name:
BDBM35649
Synonyms:
erk000537 | pyrimidylpyrrole, 10b
Type:
Small organic molecule
Emp. Form.:
C24H22FN5O2
Mol. Mass.:
431.4622
SMILES:
Cc1cnc(Nc2ccccc2)nc1-c1c[nH]c(c1)C(=O)N[C@H](CO)c1cccc(F)c1
: