Target
Dual specificity calcium/calmodulin-dependent 3',5'-cyclic nucleotide phosphodiesterase 1A
Ligand
BDBM278972
Substrate
Meas. Tech.
PDE1 Inhibition Assay
pH
7.6±n/a
Temperature
298.15±n/a K
IC50
0.460±n/a nM
Comments
extracted
Citation
 Kehler, JJuhl, KMarigo, MVital, PJJessing, MLanggård, MRasmussen, LKClementson, CM 1H-pyrazolo[4,3-b]pyridines as PDE1 inhibitors US Patent  US10034861 Publication Date 7/31/2018 
Target
Name:
Dual specificity calcium/calmodulin-dependent 3',5'-cyclic nucleotide phosphodiesterase 1A
Synonyms:
61 kDa Cam-PDE Cam-PDE 1A PDE1A_HUMAN | hCam-1
Type:
Protein
Mol. Mass.:
61245.69
Organism:
Homo sapiens (Human)
Description:
P54750
Residue:
535
  
Inhibitor
Name:
BDBM278972
Synonyms:
5-(2-ethoxy-3-pyridyl)-1-isopropyl-3-methyl-N-[(5-methylthiazol-2-yl)methyl]pyrazolo[4,3-b]pyridin-7-amine US10512632, Example 2 US10806718, Example 2 US11491140, Example 2 | US11634416, Example 2
Type:
Small organic molecule
Emp. Form.:
C22H26N6OS
Mol. Mass.:
422.546
SMILES:
CCOc1ncccc1-c1cc(NCc2ncc(C)s2)c2n(nc(C)c2n1)C(C)C
: