Target
Serum paraoxonase/arylesterase 1
Ligand
BDBM17638
Substrate
Meas. Tech.
Paraoxonase Activity Assay
pH
10.5±0
Temperature
298.15±0 K
Ki
97000±0.0 nM
IC50
195000±0.0 nM
Citation
 Ekinci, DBeydemir, S Effect of some analgesics on paraoxonase-1 purified from human serum. J Enzyme Inhib Med Chem 24:1034-9 (2009)  
Target
Name:
Serum paraoxonase/arylesterase 1
Synonyms:
A-esterase 1 K-45 PON 1 PON1_HUMAN Paraoxonase (hPON1) Serum aryldialkylphosphatase 1 | Serum paraoxonase 1 (PON1)
Type:
Enzyme
Mol. Mass.:
39719.73
Organism:
Homo sapiens (Human)
Description:
P27169
Residue:
355
  
Inhibitor
Name:
BDBM17638
Synonyms:
2-{1-[(4-chlorophenyl)carbonyl]-5-methoxy-2-methyl-1H-indol-3-yl}acetic acid Indocin US11478464, Compound Indomethacin US9271961, Indomethacin | indometacin
Type:
Small organic molecule
Emp. Form.:
C19H16ClNO4
Mol. Mass.:
357.788
SMILES:
COc1ccc2n(C(=O)c3ccc(Cl)cc3)c(C)c(CC(O)=O)c2c1
: