Target
Alpha-(1,3)-fucosyltransferase 7
Ligand
BDBM50100861
Substrate
Meas. Tech.
SPA Assay
pH
7.3±0
Temperature
295.15±0 K
IC50
137000±45000 nM
Citation
 Niu, XFan, XSun, JTing, PNarula, SLundell, D Inhibition of fucosyltransferase VII by gallic acid and its derivatives. Arch Biochem Biophys 425:51-7 (2004)  
Target
Name:
Alpha-(1,3)-fucosyltransferase 7
Synonyms:
Alpha-(1,3)-fucosyltransferase VII FUT7_HUMAN Fuct VII
Type:
Mol. Mass.:
39259.56
Organism:
Homo sapiens (Human)
Description:
Q11130
Residue:
342
  
Inhibitor
Name:
BDBM50100861
Synonyms:
3,4-Dihydroxybenzoate, VIII 4,5-Dihydroxybenzoic acid CHEMBL37537 Protocatechuic acid (M1) cid_72
Type:
Small organic molecule
Emp. Form.:
C7H6O4
Mol. Mass.:
154.1201
SMILES:
OC(=O)c1ccc(O)c(O)c1
: