Target
Acid phosphatase
Ligand
BDBM39344
Substrate
Meas. Tech.
Inhibitor Screening Assay
Ki
1.48e+4± 3.4e+3 nM
Citation
 McRae, SPagliai, FAMohapatra, NPGener, AMahmou, ASGunn, JSLorca, GLGonzalez, CF Inhibition of AcpA phosphatase activity with ascorbate attenuates Francisella tularensis intramacrophage survival. J Biol Chem 285:5171-7 (2010)  
Target
Name:
Acid phosphatase
Synonyms:
Acid phosphatase (acpA) Acid phosphatase (acpC)
Type:
Enzyme
Mol. Mass.:
22350.38
Organism:
Francisella tularensis
Description:
Q5NIC0
Residue:
194
  
Inhibitor
Name:
BDBM39344
Synonyms:
4-amino-N-[2-(diethylamino)ethyl]benzamide;hydrochloride MLS000069436 PROCAINAMIDE HYDROCHLORIDE cid_66068
Type:
Small organic molecule
Emp. Form.:
C13H21N3O
Mol. Mass.:
235.3253
SMILES:
CCN(CC)CCNC(=O)c1ccc(N)cc1
: