Target
Steroid C26-monooxygenase
Ligand
BDBM25817
Substrate
Meas. Tech.
Binding Assay
Kd
8.60e+5± 1.08e+5 nM
Citation
 Driscoll, MDMcLean, KJLevy, CMast, NPikuleva, IALafite, PRigby, SELeys, DMunro, AW Structural and biochemical characterization of Mycobacterium tuberculosis CYP142: evidence for multiple cholesterol 27-hydroxylase activities in a human pathogen. J Biol Chem 285:38270-82 (2010)  
Target
Name:
Steroid C26-monooxygenase
Synonyms:
CP142_MYCTO Cytochrome P450 142 (CYP142) | cyp142
Type:
Enzyme
Mol. Mass.:
41422.72
Organism:
Mycobacterium tuberculosis
Description:
P9WPL4
Residue:
372
  
Inhibitor
Name:
BDBM25817
Synonyms:
2-(2,4-difluorophenyl)-1,3-bis(1H-1,2,4-triazol-1-yl)propan-2-ol Diflucan Fluconazole (f) Triflucan US11247981, Example Fluconazole US9144538, Fluconazole US9556143, Fluconazole | cid_3365
Type:
Small organic molecule
Emp. Form.:
C13H12F2N6O
Mol. Mass.:
306.2708
SMILES:
OC(Cn1cncn1)(Cn1cncn1)c1ccc(F)cc1F
: