Target
Replicase polyprotein 1ab
Ligand
BDBM92520
Substrate
Meas. Tech.
Enzyme Inhibition Assay
pH
6.5±0
Temperature
298.15±0 K
Ki
38±n/a nM
Citation
 Lee, CCKuo, CJKo, TPHsu, MFTsui, YCChang, SCYang, SChen, SJChen, HCHsu, MCShih, SRLiang, PHWang, AH Structural basis of inhibition specificities of 3C and 3C-like proteases by zinc-coordinating and peptidomimetic compounds. J Biol Chem 284:7646-55 (2009)  
Target
Name:
Replicase polyprotein 1ab
Synonyms:
3C-like proteinase 3C-like proteinase (SARS-CoV 3Cpro) 3CLp GFL Guanine-N7 methyltransferase Helicase Leader protein Non-structural protein 10 Non-structural protein 3 Non-structural protein 6 Non-structural protein 8 ORF1ab polyprotein PL2-PRO Pol R1AB_SARS RdRp SARS coronavirus main proteinase nsp1 nsp12 nsp14 nsp16 nsp3 nsp5 nsp7 nsp9 pp1ab | rep
Type:
Protein
Mol. Mass.:
790250.81
Organism:
Human SARS coronavirus (SARS-CoV) (Severe acute respiratory syndrome coronavirus)
Description:
P0C6X7
Residue:
7073
  
Inhibitor
Name:
BDBM92520
Synonyms:
TG-0204998
Type:
Organic molecule
Emp. Form.:
C32H47N5O7
Mol. Mass.:
613.7449
SMILES:
CC(C)C[C@H](NC(=O)[C@H](CNC(=O)C(C)(C)C)NC(=O)OCc1ccccc1)C(=O)NC(C[C@@H]1CCNC1=O)=CCC(C)=O
: