Target
Acyl-protein thioesterase 2
Ligand
BDBM26140
Substrate
Meas. Tech.
Enzymatic Protein Activity Assay
IC50
1.13e+4± 4.0e+3 nM
Citation
 Zimmermann, TJBürger, MTashiro, EKondoh, YMartinez, NEGörmer, KRosin-Steiner, SShimizu, TOzaki, SMikoshiba, KWatanabe, NHall, DVetter, IROsada, HHedberg, CWaldmann, H Boron-based inhibitors of acyl protein thioesterases 1 and 2. Chembiochem 14:115-22 (2013)  
Target
Name:
Acyl-protein thioesterase 2
Synonyms:
APT2 LYPA2_HUMAN Lysophospholipase II
Type:
Protein
Mol. Mass.:
24740.23
Organism:
Homo sapiens (Human)
Description:
O95372
Residue:
231
  
Inhibitor
Name:
BDBM26140
Synonyms:
1-benzofuran-2-ylboranediol CHEMBL143399 | Phenylboronic acid, 21
Type:
Small organic molecule
Emp. Form.:
C8H7BO3
Mol. Mass.:
161.95
SMILES:
OB(O)c1cc2ccccc2o1
: