Target
2,6-dichloro-p-hydroquinone 1,2-dioxygenase
Ligand
BDBM92758
Substrate
Meas. Tech.
Inhibition Assay
Ki
5.3e+4± 7e+3 nM
Citation
 Machonkin, TEDoerner, AE Substrate specificity of Sphingobium chlorophenolicum 2,6-dichlorohydroquinone 1,2-dioxygenase. Biochemistry 50:8899-913 (2011)  
Target
Name:
2,6-dichloro-p-hydroquinone 1,2-dioxygenase
Synonyms:
2,6-dichloro-p-hydroquinone 1,2-dioxygenase (PcpA)
Type:
Protein
Mol. Mass.:
36504.22
Organism:
Sphingobium chlorophenolicum
Description:
Q9ZBB0
Residue:
320
  
Inhibitor
Name:
BDBM92758
Synonyms:
3-Bromocatechol
Type:
Small molecule
Emp. Form.:
C6H5BrO2
Mol. Mass.:
189.007
SMILES:
Oc1cccc(Br)c1O
: