Target
Chymotrypsinogen A
Ligand
BDBM50004955
Substrate
Meas. Tech.
Kinetic Assay
Ki
4200000±700000 nM
Citation
 ABRASH, HINIEMANN, C INTERACTION OF AROMATIC COMPOUNDS WITH ALPHA-CHYMOTRYPSIN. II. COMBINATION OF THE ISOMERIC INDOLE CARBOXAMIDES AND CARBOXYLATE IONS WITH THE ACTIVE SITE. Biochemistry 4:99-104 (1965)  
Target
Name:
Chymotrypsinogen A
Synonyms:
Alpha-chymotrypsin Chymotrypsin A Chymotrypsin A chain B Chymotrypsinogen A | alpha-Chymotrypsin (α-Chymotrypsin)
Type:
Serine protease
Mol. Mass.:
25670.88
Organism:
Bos taurus (bovine)
Description:
Residue:
245
  
Inhibitor
Name:
BDBM50004955
Synonyms:
1H-Indole-2-carboxylic acid Indol-2-carboxylic acid | Indole-2-carboxylate
Type:
Small organic molecule
Emp. Form.:
C9H7NO2
Mol. Mass.:
161.1574
SMILES:
OC(=O)c1cc2ccccc2[nH]1
: