Target
DNA gyrase subunit A
Ligand
BDBM21690
Substrate
Meas. Tech.
Enzyme Assay
IC50
1.0e+4±n/a nM
Citation
 Karkare, SChung, TTCollin, FMitchenall, LAMcKay, ARGreive, SJMeyer, JJLall, NMaxwell, A The naphthoquinone diospyrin is an inhibitor of DNA gyrase with a novel mechanism of action. J Biol Chem 288:5149-56 (2013)  
Target
Name:
DNA gyrase subunit A
Synonyms:
GYRA_MYCTU gyrA
Type:
Protein
Mol. Mass.:
92261.11
Organism:
Mycobacterium tuberculosis (strain ATCC 25618 / H37Rv)
Description:
P9WG47
Residue:
838
  
Inhibitor
Name:
BDBM21690
Synonyms:
1-cyclopropyl-6-fluoro-4-oxo-7-(piperazin-1-yl)-1,4-dihydroquinoline-3-carboxylic acid Bay 09867 Ciprinol Ciprofloxacin US9138393, Ciprofloxacin HCl | US9144538, Ciprofloxacin HCl
Type:
Small organic molecule
Emp. Form.:
C17H18FN3O3
Mol. Mass.:
331.3415
SMILES:
OC(=O)c1cn(C2CC2)c2cc(N3CCNCC3)c(F)cc2c1=O
: