Target
High affinity nerve growth factor receptor
Ligand
BDBM93148
Substrate
Meas. Tech.
Inhibition Assay
IC50
5±0.0 nM
Citation
 Raeppel, SLGaudette, FNguyen, HBeaulieu, NWang, JMaroun, CBesterman, JMVaisburg, A Identification of a Novel Series of Potent TrkA Receptor Tyrosine Kinase Inhibitors International Journal of Medicinal Chemistry 2012:1-6 (2012)   
Target
Name:
High affinity nerve growth factor receptor
Synonyms:
2.7.10.1 NTRK1 NTRK1_HUMAN Neurotrophic tyrosine kinase receptor type 1 Synonyms=MTC TRK1-transforming tyrosine kinase protein TRKA GN Tropomyosin alpha-3 chain/High affinity nerve growth factor receptor Tropomyosin-related kinase A (TrkA) Tyrosine kinase receptor (Trk) Tyrosine kinase receptor A (Trk A) Tyrosine kinase receptor A (TrkA) p140-TrkA
Type:
Mol. Mass.:
87498.18
Organism:
Homo sapiens (Human)
Description:
P04629
Residue:
796
  
Inhibitor
Name:
BDBM93148
Synonyms:
2-oxoimidazolidine-1-carboxamide, 15
Type:
Small molecule
Emp. Form.:
C23H22N6O4
Mol. Mass.:
446.4586
SMILES:
CNC(=O)Nc1cc(Oc2ccc(NC(=O)N3CCN(C3=O)c3ccccc3)cc2)ccn1
: