Target
Beta-lactamase
Ligand
BDBM67953
Substrate
IC50
12637±n/a nM
Citation
 PubChem, PC Counterscreen for inhibitors of the interaction of nucleotide-binding oligomerization domain containing 2 (NOD2) and receptor-interacting serine-threonine kinase 2 (RIPK2) PubChem Bioassay (2012)[AID] 
Target
Name:
Beta-lactamase
Synonyms:
Beta lactamase
Type:
Enzyme Catalytic Domain
Mol. Mass.:
31513.38
Organism:
Pseudomonas aeruginosa
Description:
gi_114881106
Residue:
286
  
Inhibitor
Name:
BDBM67953
Synonyms:
1-(3-chlorophenyl)-3-(1-phenyltetrazol-5-yl)sulfanylpyrrolidine-2,5-dione 1-(3-chlorophenyl)-3-[(1-phenyl-1H-tetrazol-5-yl)thio]-2,5-pyrrolidinedione 1-(3-chlorophenyl)-3-[(1-phenyltetrazol-5-yl)thio]pyrrolidine-2,5-quinone SMR000199391 | cid_2950397
Type:
Small organic molecule
Emp. Form.:
C17H12ClN5O2S
Mol. Mass.:
385.827
SMILES:
Oc1cc(Sc2nnnn2-c2ccccc2)c(O)n1-c1cccc(Cl)c1
: