Target
Beta-lactamase
Ligand
BDBM46087
Substrate
IC50
19902±n/a nM
Citation
 PubChem, PC Counterscreen for inhibitors of the interaction of nucleotide-binding oligomerization domain containing 2 (NOD2) and receptor-interacting serine-threonine kinase 2 (RIPK2) PubChem Bioassay (2012)[AID] 
Target
Name:
Beta-lactamase
Synonyms:
Beta lactamase
Type:
Enzyme Catalytic Domain
Mol. Mass.:
31513.38
Organism:
Pseudomonas aeruginosa
Description:
gi_114881106
Residue:
286
  
Inhibitor
Name:
BDBM46087
Synonyms:
5-fluoranyl-2-(4-methoxyphenyl)-1,2-benzothiazol-3-one MLS-0390936.0001 | cid_25181243
Type:
Small organic molecule
Emp. Form.:
C14H10FNO2S
Mol. Mass.:
275.298
SMILES:
COc1ccc(cc1)-n1sc2ccc(F)cc2c1=O
: