Target
Beta-lactamase
Ligand
BDBM83275
Substrate
IC50
22146±n/a nM
Citation
 PubChem, PC Counterscreen for inhibitors of the interaction of nucleotide-binding oligomerization domain containing 2 (NOD2) and receptor-interacting serine-threonine kinase 2 (RIPK2) PubChem Bioassay (2012)[AID] 
Target
Name:
Beta-lactamase
Synonyms:
Beta lactamase
Type:
Enzyme Catalytic Domain
Mol. Mass.:
31513.38
Organism:
Pseudomonas aeruginosa
Description:
gi_114881106
Residue:
286
  
Inhibitor
Name:
BDBM83275
Synonyms:
MLS002701540 cid_457901
Type:
Small organic molecule
Emp. Form.:
C22H30O7
Mol. Mass.:
406.4694
SMILES:
[H]C12CCC3C(C1O)(C(=O)C2=C)C1(O)OCC32CCCC(C)(COC(C)=O)C2C1O
: