Target
Beta-lactamase
Ligand
BDBM61910
Substrate
IC50
23408±n/a nM
Citation
 PubChem, PC Counterscreen for inhibitors of the interaction of nucleotide-binding oligomerization domain containing 2 (NOD2) and receptor-interacting serine-threonine kinase 2 (RIPK2) PubChem Bioassay (2012)[AID] 
Target
Name:
Beta-lactamase
Synonyms:
Beta lactamase
Type:
Enzyme Catalytic Domain
Mol. Mass.:
31513.38
Organism:
Pseudomonas aeruginosa
Description:
gi_114881106
Residue:
286
  
Inhibitor
Name:
BDBM61910
Synonyms:
6-fluoranyl-2-phenyl-1,2-benzothiazol-3-one KUC103671N | cid_1510378
Type:
Small organic molecule
Emp. Form.:
C13H8FNOS
Mol. Mass.:
245.272
SMILES:
Fc1ccc2c(c1)sn(-c1ccccc1)c2=O
: