Target
Protein skinhead-1
Ligand
BDBM93711
Substrate
IC50
1460±n/a nM
Citation
 PubChem, PC Dose ResponseConfirmation of SKN-1 Inhibitor hits in a fluorescence ratio assay - Set 2 PubChem Bioassay (2012)[AID] 
Target
Name:
Protein skinhead-1
Synonyms:
SKN1_CAEEL skn-1
Type:
Enzyme Catalytic Domain
Mol. Mass.:
70701.17
Organism:
Caenorhabditis elegans
Description:
P34707
Residue:
623
  
Inhibitor
Name:
BDBM93711
Synonyms:
2-(2,4-dichlorophenyl)-5-phenyl-1,3,4-oxadiazole SMR000064579 | cid_96854
Type:
Small organic molecule
Emp. Form.:
C14H8Cl2N2O
Mol. Mass.:
291.132
SMILES:
Clc1ccc(-c2nnc(o2)-c2ccccc2)c(Cl)c1
: