Target
Protein skinhead-1
Ligand
BDBM93762
Substrate
IC50
2850±n/a nM
Citation
 PubChem, PC Dose ResponseConfirmation of SKN-1 Inhibitor hits in a fluorescence ratio assay - Set 2 PubChem Bioassay (2012)[AID] 
Target
Name:
Protein skinhead-1
Synonyms:
SKN1_CAEEL skn-1
Type:
Enzyme Catalytic Domain
Mol. Mass.:
70701.17
Organism:
Caenorhabditis elegans
Description:
P34707
Residue:
623
  
Inhibitor
Name:
BDBM93762
Synonyms:
MLS000545696 N-[[3-chloro-5-ethoxy-4-[(4-fluorophenyl)methoxy]phenyl]methyl]cyclopentanamine;hydrochloride SMR000160707 cid_11948820
Type:
Small organic molecule
Emp. Form.:
C21H25ClFNO2
Mol. Mass.:
377.88
SMILES:
CCOc1cc(CNC2CCCC2)cc(Cl)c1OCc1ccc(F)cc1
: