Target
Protein skinhead-1
Ligand
BDBM93798
Substrate
IC50
2810±n/a nM
Citation
 PubChem, PC Dose ResponseConfirmation of SKN-1 Inhibitor hits in a fluorescence ratio assay - Set 2 PubChem Bioassay (2012)[AID] 
Target
Name:
Protein skinhead-1
Synonyms:
SKN1_CAEEL skn-1
Type:
Enzyme Catalytic Domain
Mol. Mass.:
70701.17
Organism:
Caenorhabditis elegans
Description:
P34707
Residue:
623
  
Inhibitor
Name:
BDBM93798
Synonyms:
6-nitro-2-phenyl-2H-indazole 6-nitro-2-phenylindazole SMR000225831 | cid_555231
Type:
Small organic molecule
Emp. Form.:
C13H9N3O2
Mol. Mass.:
239.2295
SMILES:
[O-][N+](=O)c1ccc2cn(nc2c1)-c1ccccc1
: