Target
Caspase-3
Ligand
BDBM93593
Substrate
IC50
>100000±0 nM
Citation
 PubChem, PC Dose-response confirmation of uHTS inhibitor hits of Sentrin-Specific Protease 8 in a Caspase-3 Fluorescence assay PubChem Bioassay (2012)[AID] 
Target
Name:
Caspase-3
Synonyms:
Apopain CASP3 CPP-32 Caspase 3 Caspase-3 subunit p17 SCA-1 Yama protein | caspase-3 preproprotein
Type:
Hydrolase; heterotetramer of two heterodimers
Mol. Mass.:
31607.55
Organism:
Homo sapiens (Human)
Description:
Residue:
277
  
Inhibitor
Name:
BDBM93593
Synonyms:
4-(benzenesulfonyl)-5-methyl-2-phenyl-1H-pyrazol-3-one 5-methyl-2-phenyl-4-(phenylsulfonyl)-1H-pyrazol-3-one SMR000060018 | cid_2337473
Type:
Small organic molecule
Emp. Form.:
C16H14N2O3S
Mol. Mass.:
314.359
SMILES:
Cc1[nH]n(-c2ccccc2)c(=O)c1S(=O)(=O)c1ccccc1
: