Target
Caspase-3
Ligand
BDBM93686
Substrate
IC50
83200±7380 nM
Citation
 PubChem, PC Dose-response confirmation of uHTS inhibitor hits of Sentrin-Specific Protease 8 in a Caspase-3 Fluorescence assay PubChem Bioassay (2012)[AID] 
Target
Name:
Caspase-3
Synonyms:
Apopain CASP3 CPP-32 Caspase 3 Caspase-3 subunit p17 SCA-1 Yama protein | caspase-3 preproprotein
Type:
Hydrolase; heterotetramer of two heterodimers
Mol. Mass.:
31607.55
Organism:
Homo sapiens (Human)
Description:
Residue:
277
  
Inhibitor
Name:
BDBM93686
Synonyms:
(4E)-2-benzyl-4-[(2-phenylethylamino)methylidene]isoquinoline-1,3-dione (4E)-4-[(2-phenylethylamino)methylidene]-2-(phenylmethyl)isoquinoline-1,3-dione SMR000154173 | cid_6906949
Type:
Small organic molecule
Emp. Form.:
C25H22N2O2
Mol. Mass.:
382.4544
SMILES:
O=C1N(Cc2ccccc2)C(=O)c2ccccc2C1=CNCCc1ccccc1
: