Target
Caspase-3
Ligand
BDBM93563
Substrate
IC50
11900±1620 nM
Citation
 PubChem, PC Dose-response confirmation of uHTS inhibitor hits of Sentrin-Specific Protease 8 in a Caspase-3 Fluorescence assay PubChem Bioassay (2012)[AID] 
Target
Name:
Caspase-3
Synonyms:
Apopain CASP3 CPP-32 Caspase 3 Caspase-3 subunit p17 SCA-1 Yama protein | caspase-3 preproprotein
Type:
Hydrolase; heterotetramer of two heterodimers
Mol. Mass.:
31607.55
Organism:
Homo sapiens (Human)
Description:
Residue:
277
  
Inhibitor
Name:
BDBM93563
Synonyms:
5-amino-3-(4-chlorophenyl)-4-keto-N-[(E)-p-anisylideneamino]thieno[3,4-d]pyridazine-1-carboxamide 5-amino-3-(4-chlorophenyl)-N-[(E)-(4-methoxyphenyl)methylideneamino]-4-oxo-1-thieno[3,4-d]pyridazinecarboxamide 5-azanyl-3-(4-chlorophenyl)-N-[(E)-(4-methoxyphenyl)methylideneamino]-4-oxidanylidene-thieno[3,4-d]pyridazine-1-carboxamide SMR000164097 | cid_6871358
Type:
Small organic molecule
Emp. Form.:
C21H16ClN5O3S
Mol. Mass.:
453.901
SMILES:
COc1ccc(\C=N\NC(=O)c2nn(-c3ccc(Cl)cc3)c(=O)c3c(N)scc23)cc1
: