Target
Caspase-3
Ligand
BDBM50334341
Substrate
IC50
>100000±0 nM
Citation
 PubChem, PC Dose-response confirmation of uHTS inhibitor hits of Sentrin-Specific Protease 8 in a Caspase-3 Fluorescence assay PubChem Bioassay (2012)[AID] 
Target
Name:
Caspase-3
Synonyms:
Apopain CASP3 CPP-32 Caspase 3 Caspase-3 subunit p17 SCA-1 Yama protein | caspase-3 preproprotein
Type:
Hydrolase; heterotetramer of two heterodimers
Mol. Mass.:
31607.55
Organism:
Homo sapiens (Human)
Description:
Residue:
277
  
Inhibitor
Name:
BDBM50334341
Synonyms:
CHEMBL1277150 cid_44143048
Type:
Small organic molecule
Emp. Form.:
C21H27N3O
Mol. Mass.:
337.4586
SMILES:
CCCCOc1cc(NCc2ccccc2)c2ncn(C(C)C)c2c1
: