Target
Caspase-3
Ligand
BDBM93675
Substrate
IC50
13800±536 nM
Citation
 PubChem, PC Dose-response confirmation of uHTS inhibitor hits of Sentrin-Specific Protease 8 in a Caspase-3 Fluorescence assay PubChem Bioassay (2012)[AID] 
Target
Name:
Caspase-3
Synonyms:
Apopain CASP3 CPP-32 Caspase 3 Caspase-3 subunit p17 SCA-1 Yama protein | caspase-3 preproprotein
Type:
Hydrolase; heterotetramer of two heterodimers
Mol. Mass.:
31607.55
Organism:
Homo sapiens (Human)
Description:
Residue:
277
  
Inhibitor
Name:
BDBM93675
Synonyms:
MLS002608730 N-(6-methoxy-4-methyl-quinolin-8-yl)-N'-propan-2-yl-propane-1,3-diamine SMR001527474 isopropyl-[3-[(6-methoxy-4-methyl-8-quinolyl)amino]propyl]amine
Type:
Small organic molecule
Emp. Form.:
C17H25N3O
Mol. Mass.:
287.3999
SMILES:
COc1cc(NCCCNC(C)C)c2nccc(C)c2c1
: