Target
Protein Wnt-3a
Ligand
BDBM89283
Substrate
IC50
245±n/a nM
Citation
 PubChem, PC Dose response validation of uHTS Gli-SUFU antagonist hits in a Wnt3a luminescent reporter assay PubChem Bioassay (2012)[AID] 
Target
Name:
Protein Wnt-3a
Synonyms:
WNT3A_MOUSE Wnt3a | protein Wnt-3a precursor
Type:
PROTEIN
Mol. Mass.:
39269.29
Organism:
Mus musculus
Description:
ChEMBL_813156
Residue:
352
  
Inhibitor
Name:
BDBM89283
Synonyms:
4-acetyl-3,5-dimethyl-1H-pyrrole-2-carboxylic acid [2-(4-methyl-2-nitroanilino)-2-oxoethyl] ester MLS000391298 [2-(4-methyl-2-nitroanilino)-2-oxoethyl] 4-acetyl-3,5-dimethyl-1H-pyrrole-2-carboxylate cid_5057113
Type:
Small organic molecule
Emp. Form.:
C18H19N3O6
Mol. Mass.:
373.36
SMILES:
CC(=O)c1c(C)[nH]c(C(=O)OCC(=O)Nc2ccc(C)cc2[N+]([O-])=O)c1C
: