Target
Heat shock protein hsp-16.2
Ligand
BDBM93798
Substrate
IC50
>64000±n/a nM
Citation
 PubChem, PC Dose Response Confirmation of SKN-1 Inhibitor hits via a heat-shock counterscreen assay PubChem Bioassay (2012)[AID] 
Target
Name:
Heat shock protein hsp-16.2
Synonyms:
HSP12_CAEEL hsp-16 hsp16-2
Type:
Enzyme Catalytic Domain
Mol. Mass.:
16239.18
Organism:
Caenorhabditis elegans
Description:
gi_373219859
Residue:
145
  
Inhibitor
Name:
BDBM93798
Synonyms:
6-nitro-2-phenyl-2H-indazole 6-nitro-2-phenylindazole SMR000225831 | cid_555231
Type:
Small organic molecule
Emp. Form.:
C13H9N3O2
Mol. Mass.:
239.2295
SMILES:
[O-][N+](=O)c1ccc2cn(nc2c1)-c1ccccc1
: