Target
Heat shock protein hsp-16.2
Ligand
BDBM49198
Substrate
IC50
>64000±n/a nM
Citation
 PubChem, PC Dose Response Confirmation of SKN-1 Inhibitor hits via a heat-shock counterscreen assay PubChem Bioassay (2012)[AID] 
Target
Name:
Heat shock protein hsp-16.2
Synonyms:
HSP12_CAEEL hsp-16 hsp16-2
Type:
Enzyme Catalytic Domain
Mol. Mass.:
16239.18
Organism:
Caenorhabditis elegans
Description:
gi_373219859
Residue:
145
  
Inhibitor
Name:
BDBM49198
Synonyms:
2-thienyl-[5-(2-thienyl)-2-thienyl]methanone SMR000040256 thiophen-2-yl-(5-thiophen-2-yl-2-thiophenyl)methanone | thiophen-2-yl-(5-thiophen-2-ylthiophen-2-yl)methanone
Type:
Small organic molecule
Emp. Form.:
C13H8OS3
Mol. Mass.:
276.397
SMILES:
O=C(c1cccs1)c1ccc(s1)-c1cccs1
: