Target
Heat shock protein hsp-16.2
Ligand
BDBM50171428
Substrate
IC50
>64000±n/a nM
Citation
 PubChem, PC Dose Response Confirmation of SKN-1 Inhibitor hits via a heat-shock counterscreen assay PubChem Bioassay (2012)[AID] 
Target
Name:
Heat shock protein hsp-16.2
Synonyms:
HSP12_CAEEL hsp-16 hsp16-2
Type:
Enzyme Catalytic Domain
Mol. Mass.:
16239.18
Organism:
Caenorhabditis elegans
Description:
gi_373219859
Residue:
145
  
Inhibitor
Name:
BDBM50171428
Synonyms:
5-Thiophen-2-yl-3-p-tolyl-[1,2,4]oxadiazole cid_784811
Type:
Small organic molecule
Emp. Form.:
C13H10N2OS
Mol. Mass.:
242.296
SMILES:
Cc1ccc(cc1)-c1noc(n1)-c1cccs1
: