Target
Heat shock protein hsp-16.2
Ligand
BDBM49964
Substrate
IC50
>64000±n/a nM
Citation
 PubChem, PC Dose Response Confirmation of SKN-1 Inhibitor hits via a heat-shock counterscreen assay PubChem Bioassay (2012)[AID] 
Target
Name:
Heat shock protein hsp-16.2
Synonyms:
HSP12_CAEEL hsp-16 hsp16-2
Type:
Enzyme Catalytic Domain
Mol. Mass.:
16239.18
Organism:
Caenorhabditis elegans
Description:
gi_373219859
Residue:
145
  
Inhibitor
Name:
BDBM49964
Synonyms:
MLS000771256 N-[3-chloro-4-(difluoromethoxy)phenyl]picolinamide N-[4-[bis(fluoranyl)methoxy]-3-chloranyl-phenyl]pyridine-2-carboxamide cid_2579010
Type:
Small organic molecule
Emp. Form.:
C13H9ClF2N2O2
Mol. Mass.:
298.673
SMILES:
FC(F)Oc1ccc(NC(=O)c2ccccn2)cc1Cl
: