Target
Endothelial PAS domain-containing protein 1
Ligand
BDBM38917
Substrate
IC50
<300±n/a nM
Citation
 PubChem, PC Dose response confirmation of uHTS identification of HIF-2a Inhibitors in a luminesence assay PubChem Bioassay (2012)[AID] 
Target
Name:
Endothelial PAS domain-containing protein 1
Synonyms:
BHLHE73 EPAS1_HUMAN MOP2 endothelial PAS domain-containing protein 1
Type:
PROTEIN
Mol. Mass.:
96453.58
Organism:
Homo sapiens (Human)
Description:
ChEMBL_1506501
Residue:
870
  
Inhibitor
Name:
BDBM38917
Synonyms:
3-[3-(4-tert-butylphenyl)-1,2,4-oxadiazol-5-yl]propanamide MLS000042471 cid_666941
Type:
Small organic molecule
Emp. Form.:
C15H19N3O2
Mol. Mass.:
273.3303
SMILES:
CC(C)(C)c1ccc(cc1)-c1noc(CCC(N)=O)n1
: