Target
Endothelial PAS domain-containing protein 1
Ligand
BDBM93963
Substrate
IC50
2470±n/a nM
Citation
 PubChem, PC Dose response confirmation of uHTS identification of HIF-2a Inhibitors in a luminesence assay PubChem Bioassay (2012)[AID] 
Target
Name:
Endothelial PAS domain-containing protein 1
Synonyms:
BHLHE73 EPAS1_HUMAN MOP2 endothelial PAS domain-containing protein 1
Type:
PROTEIN
Mol. Mass.:
96453.58
Organism:
Homo sapiens (Human)
Description:
ChEMBL_1506501
Residue:
870
  
Inhibitor
Name:
BDBM93963
Synonyms:
MLS000566332 N-[4-[2-(2,4-dimethylphenyl)-2-oxidanylidene-ethoxy]phenyl]ethanamide SMR000153516 | cid_2460154
Type:
Small organic molecule
Emp. Form.:
C18H19NO3
Mol. Mass.:
297.3484
SMILES:
CC(=O)Nc1ccc(OCC(=O)c2ccc(C)cc2C)cc1
: