Target
Endothelial PAS domain-containing protein 1
Ligand
BDBM93967
Substrate
IC50
1960±n/a nM
Citation
 PubChem, PC Dose response confirmation of uHTS identification of HIF-2a Inhibitors in a luminesence assay PubChem Bioassay (2012)[AID] 
Target
Name:
Endothelial PAS domain-containing protein 1
Synonyms:
BHLHE73 EPAS1_HUMAN MOP2 endothelial PAS domain-containing protein 1
Type:
PROTEIN
Mol. Mass.:
96453.58
Organism:
Homo sapiens (Human)
Description:
ChEMBL_1506501
Residue:
870
  
Inhibitor
Name:
BDBM93967
Synonyms:
2-[2-[(4-fluorobenzoyl)thiocarbamoylamino]thiazol-4-yl]acetic acid ethyl ester MLS000574284 cid_1341811 ethyl 2-[2-[(4-fluorophenyl)carbonylcarbamothioylamino]-1,3-thiazol-4-yl]ethanoate | ethyl [2-({[(4-fluorobenzoyl)amino]carbonothioyl}amino)-1,3-thiazol-4-yl]acetate
Type:
Small organic molecule
Emp. Form.:
C15H14FN3O3S2
Mol. Mass.:
367.418
SMILES:
CCOC(=O)Cc1csc(NC(=S)NC(=O)c2ccc(F)cc2)n1
: