Target
Endothelial PAS domain-containing protein 1
Ligand
BDBM94011
Substrate
IC50
864±n/a nM
Citation
 PubChem, PC Dose response confirmation of uHTS identification of HIF-2a Inhibitors in a luminesence assay PubChem Bioassay (2012)[AID] 
Target
Name:
Endothelial PAS domain-containing protein 1
Synonyms:
BHLHE73 EPAS1_HUMAN MOP2 endothelial PAS domain-containing protein 1
Type:
PROTEIN
Mol. Mass.:
96453.58
Organism:
Homo sapiens (Human)
Description:
ChEMBL_1506501
Residue:
870
  
Inhibitor
Name:
BDBM94011
Synonyms:
(3-aminophenyl)(3,4-dimethylphenyl)methanone MLS000722912 cid_684128
Type:
Small organic molecule
Emp. Form.:
C15H15NO
Mol. Mass.:
225.2857
SMILES:
Cc1ccc(cc1C)C(=O)c1cccc(N)c1
: