Target
Endothelial PAS domain-containing protein 1
Ligand
BDBM59558
Substrate
IC50
212±n/a nM
Citation
 PubChem, PC Dose response confirmation of uHTS identification of HIF-2a Inhibitors in a luminesence assay PubChem Bioassay (2012)[AID] 
Target
Name:
Endothelial PAS domain-containing protein 1
Synonyms:
BHLHE73 EPAS1_HUMAN MOP2 endothelial PAS domain-containing protein 1
Type:
PROTEIN
Mol. Mass.:
96453.58
Organism:
Homo sapiens (Human)
Description:
ChEMBL_1506501
Residue:
870
  
Inhibitor
Name:
BDBM59558
Synonyms:
3-(2-methyl-6-phenyl-thieno[2,3-d]pyrimidin-4-yl)sulfanylpropanoic acid 3-[(2-methyl-6-phenyl-4-thieno[2,3-d]pyrimidinyl)thio]propanoic acid MLS001172697 cid_2343817
Type:
Small organic molecule
Emp. Form.:
C16H14N2O2S2
Mol. Mass.:
330.425
SMILES:
Cc1nc(SCCC(O)=O)c2cc(sc2n1)-c1ccccc1
: