Target
Endothelial PAS domain-containing protein 1
Ligand
BDBM94053
Substrate
IC50
512±n/a nM
Citation
 PubChem, PC Dose response confirmation of uHTS identification of HIF-2a Inhibitors in a luminesence assay PubChem Bioassay (2012)[AID] 
Target
Name:
Endothelial PAS domain-containing protein 1
Synonyms:
BHLHE73 EPAS1_HUMAN MOP2 endothelial PAS domain-containing protein 1
Type:
PROTEIN
Mol. Mass.:
96453.58
Organism:
Homo sapiens (Human)
Description:
ChEMBL_1506501
Residue:
870
  
Inhibitor
Name:
BDBM94053
Synonyms:
(2S)-1-[3-(2-keto-4-methyl-6,7,8,9-tetrahydrobenzofuro[3,2-g]chromen-3-yl)propanoyl]proline (2S)-1-[3-(4-methyl-2-oxo-6,7,8,9-tetrahydro-[1]benzofuro[3,2-g]chromen-3-yl)propanoyl]pyrrolidine-2-carboxylic acid MLS001141071 cid_6351343
Type:
Small organic molecule
Emp. Form.:
C24H25NO6
Mol. Mass.:
423.4584
SMILES:
Cc1c(CCC(=O)N2CCC[C@H]2C(O)=O)c(=O)oc2cc3oc4CCCCc4c3cc12
: