Target
Corticotropin-releasing factor-binding protein
Ligand
BDBM90766
Substrate
IC50
5130±n/a nM
Citation
 PubChem, PC Dose Response confirmation of uHTS hits for small molecule antagonists of the CRF-binding protein and CRF-R2 receptor complex in 384 well format PubChem Bioassay (2012)[AID] 
Target
Name:
Corticotropin-releasing factor-binding protein
Synonyms:
CRFBP CRHBP_HUMAN | corticotropin releasing factor-binding protein
Type:
Enzyme Catalytic Domain
Mol. Mass.:
36143.95
Organism:
Homo sapiens (Human)
Description:
P24387
Residue:
322
  
Inhibitor
Name:
BDBM90766
Synonyms:
1-[(2-benzyl-5-tert-butyl-pyrazole-3-carbonyl)amino]-3-(3-chlorophenyl)urea 1-[[5-tert-butyl-2-(phenylmethyl)pyrazol-3-yl]carbonylamino]-3-(3-chlorophenyl)urea MLS000834880 SMR000461396 | cid_2744568
Type:
Small organic molecule
Emp. Form.:
C22H24ClN5O2
Mol. Mass.:
425.911
SMILES:
CC(C)(C)c1cc(C(=O)NNC(=O)Nc2cccc(Cl)c2)n(Cc2ccccc2)n1
: