Target
Corticotropin-releasing factor-binding protein
Ligand
BDBM89994
Substrate
IC50
5990±n/a nM
Citation
 PubChem, PC Dose Response confirmation of uHTS hits for small molecule antagonists of the CRF-binding protein and CRF-R2 receptor complex in 384 well format PubChem Bioassay (2012)[AID] 
Target
Name:
Corticotropin-releasing factor-binding protein
Synonyms:
CRFBP CRHBP_HUMAN | corticotropin releasing factor-binding protein
Type:
Enzyme Catalytic Domain
Mol. Mass.:
36143.95
Organism:
Homo sapiens (Human)
Description:
P24387
Residue:
322
  
Inhibitor
Name:
BDBM89994
Synonyms:
1-(3,5-Dimethyl-piperidin-1-yl)-2-(2-thiophen-2-ylmethyl-quinazolin-4-ylsulfanyl)-ethanone 1-(3,5-dimethylpiperidin-1-yl)-2-[2-(thiophen-2-ylmethyl)quinazolin-4-yl]sulfanyl-ethanone 1-(3,5-dimethylpiperidino)-2-[[2-(2-thenyl)quinazolin-4-yl]thio]ethanone SMR000173434 | cid_3221486
Type:
Small organic molecule
Emp. Form.:
C22H25N3OS2
Mol. Mass.:
411.583
SMILES:
CC1CC(C)CN(C1)C(=O)CSc1nc(Cc2cccs2)nc2ccccc12
: