Target
Corticotropin-releasing factor-binding protein
Ligand
BDBM89737
Substrate
IC50
2160±n/a nM
Citation
 PubChem, PC Dose Response confirmation of uHTS hits for small molecule antagonists of the CRF-binding protein and CRF-R2 receptor complex in 384 well format PubChem Bioassay (2012)[AID] 
Target
Name:
Corticotropin-releasing factor-binding protein
Synonyms:
CRFBP CRHBP_HUMAN | corticotropin releasing factor-binding protein
Type:
Enzyme Catalytic Domain
Mol. Mass.:
36143.95
Organism:
Homo sapiens (Human)
Description:
P24387
Residue:
322
  
Inhibitor
Name:
BDBM89737
Synonyms:
1-(5-chloranyl-2-ethoxy-phenyl)sulfonylbenzotriazole 1-(5-chloro-2-ethoxyphenyl)sulfonylbenzotriazole MLS000063730 cid_976825
Type:
Small organic molecule
Emp. Form.:
C14H12ClN3O3S
Mol. Mass.:
337.781
SMILES:
CCOc1ccc(Cl)cc1S(=O)(=O)n1nnc2ccccc12
: