Target
Corticotropin-releasing factor-binding protein
Ligand
BDBM70574
Substrate
IC50
4460±n/a nM
Citation
 PubChem, PC Dose Response confirmation of uHTS hits for small molecule antagonists of the CRF-binding protein and CRF-R2 receptor complex in 384 well format PubChem Bioassay (2012)[AID] 
Target
Name:
Corticotropin-releasing factor-binding protein
Synonyms:
CRFBP CRHBP_HUMAN | corticotropin releasing factor-binding protein
Type:
Enzyme Catalytic Domain
Mol. Mass.:
36143.95
Organism:
Homo sapiens (Human)
Description:
P24387
Residue:
322
  
Inhibitor
Name:
BDBM70574
Synonyms:
MLS000559428 cid_3930693
Type:
Small organic molecule
Emp. Form.:
C23H22N2O3S
Mol. Mass.:
406.497
SMILES:
COc1ccc(cc1)N1C(=O)CSC11C(=O)N2c3c1cccc3C(C)=CC2(C)C
: