Target
Neuropilin-1
Ligand
BDBM94100
Substrate
IC50
>95000±n/a nM
Citation
 PubChem, PC Dose Response confirmation of small molecule modulators of the interaction between CendR and NRP-1 in a panel assay PubChem Bioassay (2012)[AID] 
Target
Name:
Neuropilin-1
Synonyms:
Chain A, Crystal Structure Of The B1b2 Domains From Human Neuropilin- 1 NRP1 Neuropilin-1 | VEGF165R
Type:
PROTEIN
Mol. Mass.:
103122.09
Organism:
Homo sapiens (Human)
Description:
ChEMBL_617636
Residue:
923
  
Inhibitor
Name:
BDBM94100
Synonyms:
4-[3-(4-chlorophenyl)-1-oxa-2,8-diazaspiro[4.5]dec-2-en-8-yl]-3-nitro-N-(phenylmethyl)benzamide N-benzyl-4-[3-(4-chlorophenyl)-1-oxa-2,8-diazaspiro[4.5]dec-2-en-8-yl]-3-nitro-benzamide SMR000673526 | cid_24789307
Type:
Small organic molecule
Emp. Form.:
C27H25ClN4O4
Mol. Mass.:
504.965
SMILES:
[O-][N+](=O)c1cc(ccc1N1CCC2(C[C+]([N-]O2)c2ccc(Cl)cc2)CC1)C(=O)NCc1ccccc1
: