Target
Neuropilin-1
Ligand
BDBM94107
Substrate
IC50
>95000±n/a nM
Citation
 PubChem, PC Dose Response confirmation of small molecule modulators of the interaction between CendR and NRP-1 in a panel assay PubChem Bioassay (2012)[AID] 
Target
Name:
Neuropilin-1
Synonyms:
Chain A, Crystal Structure Of The B1b2 Domains From Human Neuropilin- 1 NRP1 Neuropilin-1 | VEGF165R
Type:
PROTEIN
Mol. Mass.:
103122.09
Organism:
Homo sapiens (Human)
Description:
ChEMBL_617636
Residue:
923
  
Inhibitor
Name:
BDBM94107
Synonyms:
MLS001193249 N-[2-(cyclohexylamino)-2-oxidanylidene-ethyl]-N-[(4-methylphenyl)methyl]-1,2,3-thiadiazole-4-carboxamide N-[2-(cyclohexylamino)-2-oxoethyl]-N-[(4-methylphenyl)methyl]thiadiazole-4-carboxamide [1,2,3]Thiadiazole-4-carboxylic acid cyclohexylcarbamoylmethyl-(4-methyl-benzyl)-amide | cid_1467672
Type:
Small organic molecule
Emp. Form.:
C19H24N4O2S
Mol. Mass.:
372.484
SMILES:
Cc1ccc(CN(CC(=O)NC2CCCCC2)C(=O)c2csnn2)cc1
: