Target
Neuropilin-1
Ligand
BDBM94161
Substrate
IC50
57500±n/a nM
Citation
 PubChem, PC Dose Response confirmation of small molecule modulators of the interaction between CendR and NRP-1 in a panel assay PubChem Bioassay (2012)[AID] 
Target
Name:
Neuropilin-1
Synonyms:
Chain A, Crystal Structure Of The B1b2 Domains From Human Neuropilin- 1 NRP1 Neuropilin-1 | VEGF165R
Type:
PROTEIN
Mol. Mass.:
103122.09
Organism:
Homo sapiens (Human)
Description:
ChEMBL_617636
Residue:
923
  
Inhibitor
Name:
BDBM94161
Synonyms:
3-chloranyl-5-(3,4-dimethoxyphenyl)-7-(trifluoromethyl)-1,5,6,7-tetrahydropyrazolo[1,5-a]pyrimidine-2-carboxylic acid MLS000109820 cid_5310748
Type:
Small organic molecule
Emp. Form.:
C16H15ClF3N3O4
Mol. Mass.:
405.756
SMILES:
COc1ccc(cc1OC)C1CC(n2nc(C(O)=O)c(Cl)c2N1)C(F)(F)F
: