Target
Neuropilin-1
Ligand
BDBM94188
Substrate
IC50
>95000±n/a nM
Citation
 PubChem, PC Dose Response confirmation of small molecule modulators of the interaction between CendR and NRP-1 in a panel assay PubChem Bioassay (2012)[AID] 
Target
Name:
Neuropilin-1
Synonyms:
Chain A, Crystal Structure Of The B1b2 Domains From Human Neuropilin- 1 NRP1 Neuropilin-1 | VEGF165R
Type:
PROTEIN
Mol. Mass.:
103122.09
Organism:
Homo sapiens (Human)
Description:
ChEMBL_617636
Residue:
923
  
Inhibitor
Name:
BDBM94188
Synonyms:
(5S)-1-[2-(1-adamantyl)ethyl]-5-(4-aminobutyl)-4,5-dihydroimidazol-2-amine MLS000697904 [(5S)-1-[2-(1-adamantyl)ethyl]-5-(4-aminobutyl)-2-imidazolin-2-yl]amine | cid_16682598
Type:
Small organic molecule
Emp. Form.:
C19H34N4
Mol. Mass.:
318.5001
SMILES:
[H]C12CC3([H])CC([H])(C1)CC(CCN1[C@@H](CCCCN)CN=C1N)(C2)C3
: