Target
Neuropilin-1
Ligand
BDBM94198
Substrate
IC50
>95000±n/a nM
Citation
 PubChem, PC Dose Response confirmation of small molecule modulators of the interaction between CendR and NRP-1 in a panel assay PubChem Bioassay (2012)[AID] 
Target
Name:
Neuropilin-1
Synonyms:
Chain A, Crystal Structure Of The B1b2 Domains From Human Neuropilin- 1 NRP1 Neuropilin-1 | VEGF165R
Type:
PROTEIN
Mol. Mass.:
103122.09
Organism:
Homo sapiens (Human)
Description:
ChEMBL_617636
Residue:
923
  
Inhibitor
Name:
BDBM94198
Synonyms:
3-[2-[acetamido-(3-methoxyphenyl)methyl]-1,3-thiazol-4-yl]-N,N-diethyl-benzamide 3-[2-[acetamido-(3-methoxyphenyl)methyl]-4-thiazolyl]-N,N-diethylbenzamide MLS003122683 cid_46948394
Type:
Small organic molecule
Emp. Form.:
C24H27N3O3S
Mol. Mass.:
437.554
SMILES:
CCN(CC)C(=O)c1cccc(c1)-c1csc(n1)C(NC(C)=O)c1cccc(OC)c1
: