Target
Neuropilin-1
Ligand
BDBM94244
Substrate
IC50
34400±n/a nM
Citation
 PubChem, PC Dose Response confirmation of small molecule modulators of the interaction between CendR and NRP-1 in a panel assay PubChem Bioassay (2012)[AID] 
Target
Name:
Neuropilin-1
Synonyms:
Chain A, Crystal Structure Of The B1b2 Domains From Human Neuropilin- 1 NRP1 Neuropilin-1 | VEGF165R
Type:
PROTEIN
Mol. Mass.:
103122.09
Organism:
Homo sapiens (Human)
Description:
ChEMBL_617636
Residue:
923
  
Inhibitor
Name:
BDBM94244
Synonyms:
2-[[4-(4-chlorophenyl)-5-(2,4-dichlorophenyl)-1,2,4-triazol-3-yl]sulfanyl]acetic acid 2-[[4-(4-chlorophenyl)-5-(2,4-dichlorophenyl)-1,2,4-triazol-3-yl]thio]acetic acid SMR000515338 cid_984194
Type:
Small organic molecule
Emp. Form.:
C16H10Cl3N3O2S
Mol. Mass.:
414.694
SMILES:
OC(=O)CSc1nnc(-c2ccc(Cl)cc2Cl)n1-c1ccc(Cl)cc1
: