Target
Neuropilin-1
Ligand
BDBM94311
Substrate
IC50
33800±n/a nM
Citation
 PubChem, PC Dose Response confirmation of small molecule modulators of the interaction between CendR and NRP-1 in a panel assay PubChem Bioassay (2012)[AID] 
Target
Name:
Neuropilin-1
Synonyms:
Chain A, Crystal Structure Of The B1b2 Domains From Human Neuropilin- 1 NRP1 Neuropilin-1 | VEGF165R
Type:
PROTEIN
Mol. Mass.:
103122.09
Organism:
Homo sapiens (Human)
Description:
ChEMBL_617636
Residue:
923
  
Inhibitor
Name:
BDBM94311
Synonyms:
2-(2-methylphenoxy)-N-(o-tolylthiocarbamoyl)acetamide 2-(2-methylphenoxy)-N-[(2-methylphenyl)carbamothioyl]ethanamide N-[(2-methylanilino)-sulfanylidenemethyl]-2-(2-methylphenoxy)acetamide cid_833806
Type:
Small organic molecule
Emp. Form.:
C17H18N2O2S
Mol. Mass.:
314.402
SMILES:
Cc1ccccc1NC(=S)NC(=O)COc1ccccc1C
: