Target
Perilipin-1
Ligand
BDBM94499
Substrate
IC50
2604±n/a nM
Citation
 PubChem, PC Counterscreen for inhibitors of the interaction of the lipase co-activator protein, abhydrolase domain containing 5 (ABHD5) with perilipin-5 (MLDP; PLIN5) PubChem Bioassay (2012)[AID] 
Target
Name:
Perilipin-1
Synonyms:
PERI PLIN1 | PLIN1_HUMAN
Type:
Enzyme Catalytic Domain
Mol. Mass.:
55988.69
Organism:
Homo sapiens (Human)
Description:
gi_223718203
Residue:
522
  
Inhibitor
Name:
BDBM94499
Synonyms:
3-(diphenylmethyl)oxy-N,N-diethyl-1-butanamine;2-hydroxypropane-1,2,3-tricarboxylic acid 3-benzhydryloxy-N,N-diethylbutan-1-amine;2-hydroxypropane-1,2,3-tricarboxylic acid MLS000718009 cid_16187828
Type:
Small organic molecule
Emp. Form.:
C21H29NO
Mol. Mass.:
311.4611
SMILES:
CCN(CC)CCC(C)OC(c1ccccc1)c1ccccc1
: